{"text_format":"1","workbook":"xlsx","n_sheets":5,"sheets":["Budget recherche (vierge)","Exemple","Glossaire","Lookup","Exporter la feuille de calcul"],"not_rendered":{"charts":0,"images":0,"macros":1,"external_links":0,"defined_names":2,"comments":1,"pivot_tables":0},"unopened":[],"bounds":{"document_bytes":16777216,"sheet_cells":100000,"rows_first":2000,"rows_last":500,"rows_between":2000,"halvings":0,"cell_chars":16384,"cell_head_chars":4096},"cells_cut":0,"cells_raw":0,"read":"whole","date_system":"1900"}

{"sheet":"Budget recherche (vierge)","index":0,"n_rows":77,"n_cols":8,"rows_kept":77,"cut":false,"hidden":false,"merged":[[62,4,62,6],[33,1,33,6],[34,1,34,6],[35,1,35,6],[60,4,60,6],[36,4,36,6],[58,0,58,5],[55,0,55,3],[39,3,39,4],[40,3,40,4],[41,3,41,4],[42,3,42,4],[29,4,29,6],[20,4,20,6],[32,1,32,6],[43,4,43,6],[55,4,55,6],[7,5,7,7],[4,5,4,6],[5,5,5,6],[7,2,7,3],[7,0,7,1],[0,0,1,7],[2,0,2,7],[4,1,4,2],[4,3,4,4],[5,1,5,2],[5,3,5,4]]}
["Budget prévisionnel"]
[]
["Merci de remplir uniquement les cellules en jaune."]
[]
["Nom du projet","Responsable du projet",null,"Entité UNIGE",null,"Mandant",null,"Date"]
[]
[]
["Aide convertisseur d'heures en mois",null,"Nombre d'heures",null,null,{"$f":"\"Durée en mois = \"&ROUNDUP(E8/(21*8),2)&\" mois\"","v":"Durée en mois = 0 mois"}]
[]
[]
["Coût direct additionnel"]
["Catégorie de personnel\n(Choisir dans la liste déroulante ci-dessous)","Nbre Poste","Taux \nd'activité\n(en %)","Durée \nen mois","Salaire mensuel,\nsi connu d'avance\n(yc. 13ème salaire et sans charges soc.)","Salaire moy. indicatif\n(sans ch. soc.)","Charges sociales +23%","Coût "]
[null,null,null,null,null,{"$f":"IF(OR($A13=0,$E13<>0),\"\",VLOOKUP('Budget recherche (vierge)'!$A13,Lookup!$A:$E,3,FALSE))","v":""},{"$f":"IF(OR($E13<>\"\",$F13<>\"\"),1.23,\"\")","v":""},{"$f":"IF($A13=0,\"\",IF($E13=0,B13*C13*D13*F13*G13,B13*C13*D13*E13*G13))","v":""}]
[null,null,null,null,null,{"$f":"IF(OR($A14=0,$E14<>0),\"\",VLOOKUP('Budget recherche (vierge)'!$A14,Lookup!$A:$E,3,FALSE))","v":""},"",{"$f":"IF($A14=0,\"\",IF($E14=0,B14*C14*D14*F14*G14,B14*C14*D14*E14*G14))","v":""}]
[null,null,null,null,null,{"$f":"IF(OR($A15=0,$E15<>0),\"\",VLOOKUP('Budget recherche (vierge)'!$A15,Lookup!$A:$E,3,FALSE))","v":""},"",""]
[null,null,null,null,null,{"$f":"IF(OR($A16=0,$E16<>0),\"\",VLOOKUP('Budget recherche (vierge)'!$A16,Lookup!$A:$E,3,FALSE))","v":""},"",""]
[null,null,null,null,null,{"$f":"IF(OR($A17=0,$E17<>0),\"\",VLOOKUP('Budget recherche (vierge)'!$A17,Lookup!$A:$E,3,FALSE))","v":""},"",""]
[null,null,null,null,null,{"$f":"IF(OR($A18=0,$E18<>0),\"\",VLOOKUP('Budget recherche (vierge)'!$A18,Lookup!$A:$E,3,FALSE))","v":""},"",""]
[null,null,null,null,null,{"$f":"IF(OR($A19=0,$E19<>0),\"\",VLOOKUP('Budget recherche (vierge)'!$A19,Lookup!$A:$E,3,FALSE))","v":""},"",""]
[null,null,null,null,null,{"$f":"IF(OR($A20=0,$E20<>0),\"\",VLOOKUP('Budget recherche (vierge)'!$A20,Lookup!$A:$E,3,FALSE))","v":""},"",{"$f":"IF($A20=0,\"\",IF($E20=0,B20*C20*D20*F20*G20,B20*C20*D20*E20*G20))","v":""}]
[null,null,null,null,"Charges de personnel (sous-total)",null,null,{"$f":"SUM(H13:H20)","v":0}]
[]
["Coût direct d'encadrement"]
["Catégorie de personnel\n(Choisir dans la liste déroulante ci-dessous)","Nbre Poste","Taux \nd'activité\n(en %)","Durée \nen mois","Salaire mensuel,\nsi connu d'avance\n(yc. 13ème salaire et sans charges soc.)","Salaire moy. indicatif\n(sans ch. soc.)","Charges sociales +23%","Coût "]
[null,null,null,null,null,{"$f":"IF(OR($A25=0,$E25<>0),\"\",VLOOKUP('Budget recherche (vierge)'!$A25,Lookup!$G:$K,3,FALSE))","v":""},{"$f":"IF(OR($E25<>\"\",$F25<>\"\"),1.23,\"\")","v":""},{"$f":"IF($A25=0,\"\",IF($E25=0,B25*C25*D25*F25*G25,B25*C25*D25*E25*G25))","v":""}]
[null,null,null,null,null,{"$f":"IF(OR($A26=0,$E26<>0),\"\",VLOOKUP('Budget recherche (vierge)'!$A26,Lookup!$G:$K,3,FALSE))","v":""},"",{"$f":"IF($A26=0,\"\",IF($E26=0,B26*C26*D26*F26*G26,B26*C26*D26*E26*G26))","v":""}]
[null,null,null,null,null,{"$f":"IF(OR($A27=0,$E27<>0),\"\",VLOOKUP('Budget recherche (vierge)'!$A27,Lookup!$G:$K,3,FALSE))","v":""},"",{"$f":"IF($A27=0,\"\",IF($E27=0,B27*C27*D27*F27*G27,B27*C27*D27*E27*G27))","v":""}]
[null,null,null,null,null,{"$f":"IF(OR($A28=0,$E28<>0),\"\",VLOOKUP('Budget recherche (vierge)'!$A28,Lookup!$G:$K,3,FALSE))","v":""},"",{"$f":"IF($A28=0,\"\",IF($E28=0,B28*C28*D28*F28*G28,B28*C28*D28*E28*G28))","v":""}]
[null,null,null,null,null,{"$f":"IF(OR($A29=0,$E29<>0),\"\",VLOOKUP('Budget recherche (vierge)'!$A29,Lookup!$G:$K,3,FALSE))","v":""},"",{"$f":"IF($A29=0,\"\",IF($E29=0,B29*C29*D29*F29*G29,B29*C29*D29*E29*G29))","v":""}]
[null,null,null,null,"Charges de personnel (sous-total)",null,null,{"$f":"SUM(H25:H29)","v":0}]
[]
["Coût direct de fonctionnement"]
["Consommables\n(Choisir dans la liste déroulante ci-dessous)","Détails / Explications",null,null,null,null,null,"Coût "]
[]
[]
[]
[null,null,null,null,"Dépenses générales (sous-total)",null,null,{"$f":"SUM(H34:H36)","v":0}]
[]
["Coûts liés aux équipements"]
["Immobilisations corporelles\n(Choisir dans la liste déroulante ci-dessous)","Achat spécifique au projet?","Durée \nen mois","Coût d'acquisition",null,"Durée de vie équipement \nen années","Coût annuel","Coût"]
{"$rows_left_out":38}
{"sheet":"Exemple","index":1,"n_rows":66,"n_cols":13,"rows_kept":66,"cut":false,"hidden":false,"merged":[[23,11,23,12],[0,0,0,7],[2,0,2,7],[4,1,4,2],[4,3,4,4],[4,5,4,6],[5,1,5,2],[5,3,5,4],[5,5,5,6],[7,0,7,1],[7,2,7,3],[7,5,7,6],[11,11,11,12],[20,4,20,6],[39,11,39,12],[43,4,43,6],[46,0,46,3],[46,4,46,6],[29,4,29,6],[32,0,32,6],[32,11,32,12],[33,1,33,6],[34,1,34,6],[35,1,35,6],[49,0,49,5],[51,4,51,6],[53,4,53,6],[36,4,36,6],[39,5,39,6]]}
["Budget sur la durée du projet de recherche"]
[]
["Merci de remplir uniquement les cellules en jaune."]
[]
["Nom du projet","Responsable du projet",null,"Entité UNIGE",null,"Mandant",null,"Date"]
["Léman Azure","Jérôme TARTEMPION",null,"CISA",null,"CERN",null,"2014-07-15"]
[]
["À option: convertisseur d'heures en mois",null,"Nombre d'heures",null,1008,"Durée en mois",null,{"$f":"ROUNDUP(E8/(21*8),2)&\" mois\"","v":"6 mois"}]
[]
[]
["Coût direct additionnel"]
["Catégorie de personnel\n(Choisir dans la liste déroulante ci-dessous)","Nbre Poste","Taux \nd'activité\n(en %)","Durée \nen mois","Salaire mensuel,\nsi connu d'avance\n(yc. 13ème salaire et sans charges soc.)","Salaire moy. indicatif\n(sans ch. soc.)","Charges sociales\n+23%","Coût ","Coût\nlocaux admin. / an","Coût\nlocaux admin.",null,"Bailleurs de fonds"]
["1400-Assistants et post-doc",1,0.8,6,null,{"$f":"IF(OR($A13=0,$E13<>0),\"\",VLOOKUP(Exemple!$A13,Lookup!$A:$E,3,FALSE))","v":6250},{"$f":"IF(OR($E13<>\"\",$F13<>\"\"),1.23,\"\")","v":1.23},{"$f":"IF($A13=0,\"\",IF($E13=0,B13*C13*D13*F13*G13,B13*C13*D13*E13*G13))","v":36900.000000000007},{"$f":"IF($A13=0,\"\",VLOOKUP($A13,Lookup!$A:$E,5,FALSE))","v":2940},{"$f":"_xlfn.IFS($D13=0,0,$C13>=0.5,($I13/12)*$D13,$C13<0.5,($I13/12)*$D13*$C13)","v":1470},null,{"$f":"IF(OR($M13=0,$H13=\"\"),\"\",$M13*$H13)","v":36900.000000000007},1]
[null,null,null,null,null,{"$f":"IF(OR($A14=0,$E14<>0),\"\",VLOOKUP(Exemple!$A14,Lookup!$A:$E,3,FALSE))","v":""},"",{"$f":"IF($A14=0,\"\",IF($E14=0,B14*C14*D14*F14*G14,B14*C14*D14*E14*G14))","v":""},{"$f":"IF($A14=0,\"\",VLOOKUP($A14,Lookup!$A:$E,5,FALSE))","v":""},{"$f":"_xlfn.IFS($D14=0,0,$C14>=0.5,($I14/12)*$D14,$C14<0.5,($I14/12)*$D14*$C14)","v":0},null,{"$f":"IF(OR($M14=0,$H14=\"\"),\"\",$M14*$H14)","v":""}]
[null,null,null,null,null,{"$f":"IF(OR($A15=0,$E15<>0),\"\",VLOOKUP(Exemple!$A15,Lookup!$A:$E,3,FALSE))","v":""},"","",{"$f":"IF($A15=0,\"\",VLOOKUP($A15,Lookup!$A:$E,5,FALSE))","v":""},{"$f":"_xlfn.IFS($D15=0,0,$C15>=0.5,($I15/12)*$D15,$C15<0.5,($I15/12)*$D15*$C15)","v":0},null,""]
[null,null,null,null,null,{"$f":"IF(OR($A16=0,$E16<>0),\"\",VLOOKUP(Exemple!$A16,Lookup!$A:$E,3,FALSE))","v":""},"","",{"$f":"IF($A16=0,\"\",VLOOKUP($A16,Lookup!$A:$E,5,FALSE))","v":""},{"$f":"_xlfn.IFS($D16=0,0,$C16>=0.5,($I16/12)*$D16,$C16<0.5,($I16/12)*$D16*$C16)","v":0},null,""]
[null,null,null,null,null,{"$f":"IF(OR($A17=0,$E17<>0),\"\",VLOOKUP(Exemple!$A17,Lookup!$A:$E,3,FALSE))","v":""},"","",{"$f":"IF($A17=0,\"\",VLOOKUP($A17,Lookup!$A:$E,5,FALSE))","v":""},0,null,""]
[null,null,null,null,null,{"$f":"IF(OR($A18=0,$E18<>0),\"\",VLOOKUP(Exemple!$A18,Lookup!$A:$E,3,FALSE))","v":""},"","",{"$f":"IF($A18=0,\"\",VLOOKUP($A18,Lookup!$A:$E,5,FALSE))","v":""},0,null,""]
[null,null,null,null,null,{"$f":"IF(OR($A19=0,$E19<>0),\"\",VLOOKUP(Exemple!$A19,Lookup!$A:$E,3,FALSE))","v":""},"","",{"$f":"IF($A19=0,\"\",VLOOKUP($A19,Lookup!$A:$E,5,FALSE))","v":""},0,null,""]
[null,null,null,null,null,{"$f":"IF(OR($A20=0,$E20<>0),\"\",VLOOKUP(Exemple!$A20,Lookup!$A:$E,3,FALSE))","v":""},"",{"$f":"IF($A20=0,\"\",IF($E20=0,B20*C20*D20*F20*G20,B20*C20*D20*E20*G20))","v":""},{"$f":"IF($A20=0,\"\",VLOOKUP($A20,Lookup!$A:$E,5,FALSE))","v":""},0,null,""]
[null,null,null,null,"Charges de personnel (sous-total)",null,null,{"$f":"SUM(H13:H20)","v":36900.000000000007},{"$f":"SUM(I13:I20)","v":2940},{"$f":"SUM(J13:J20)","v":1470},null,{"$f":"SUM(L13:L20)","v":36900.000000000007},{"$f":"IF(H21=0,0,L21/H21)","v":1}]
[]
["Coût direct d'encadrement"]
["Catégorie de personnel\n(Choisir dans la liste déroulante ci-dessous)","Nbre Poste","Taux \nd'activité\n(en %)","Durée \nen mois","Salaire mensuel,\nsi connu d'avance\n(yc. 13ème salaire et sans charges soc.)","Salaire moy. indicatif\n(sans ch. soc.)","Charges sociales\n+23%","Coût ",null,null,null,"Bailleurs de fonds"]
["0100-Professeurs ordinaires",1,0.05,6,null,{"$f":"IF(OR($A25=0,$E25<>0),\"\",VLOOKUP(Exemple!$A25,Lookup!$G:$K,3,FALSE))","v":17250},{"$f":"IF(OR($E25<>\"\",$F25<>\"\"),1.23,\"\")","v":1.23},{"$f":"IF($A25=0,\"\",IF($E25=0,B25*C25*D25*F25*G25,B25*C25*D25*E25*G25))","v":6365.2500000000009},null,null,null,{"$f":"IF(OR($M25=0,$H25=\"\"),\"\",$M25*$H25)","v":5092.2000000000007},0.8]
[null,null,null,null,null,{"$f":"IF(OR($A26=0,$E26<>0),\"\",VLOOKUP(Exemple!$A26,Lookup!$G:$K,3,FALSE))","v":""},"",{"$f":"IF($A26=0,\"\",IF($E26=0,B26*C26*D26*F26*G26,B26*C26*D26*E26*G26))","v":""},null,null,null,{"$f":"IF(OR($M26=0,$H26=\"\"),\"\",$M26*$H26)","v":""}]
[null,null,null,null,null,{"$f":"IF(OR($A27=0,$E27<>0),\"\",VLOOKUP(Exemple!$A27,Lookup!$G:$K,3,FALSE))","v":""},"",{"$f":"IF($A27=0,\"\",IF($E27=0,B27*C27*D27*F27*G27,B27*C27*D27*E27*G27))","v":""},null,null,null,""]
[null,null,null,null,null,{"$f":"IF(OR($A28=0,$E28<>0),\"\",VLOOKUP(Exemple!$A28,Lookup!$G:$K,3,FALSE))","v":""},"",{"$f":"IF($A28=0,\"\",IF($E28=0,B28*C28*D28*F28*G28,B28*C28*D28*E28*G28))","v":""},null,null,null,""]
[null,null,null,null,null,{"$f":"IF(OR($A29=0,$E29<>0),\"\",VLOOKUP(Exemple!$A29,Lookup!$G:$K,3,FALSE))","v":""},"",{"$f":"IF($A29=0,\"\",IF($E29=0,B29*C29*D29*F29*G29,B29*C29*D29*E29*G29))","v":""},null,null,null,""]
[null,null,null,null,"Charges de personnel (sous-total)",null,null,{"$f":"SUM(H25:H29)","v":6365.2500000000009},null,null,null,{"$f":"SUM(L25:L29)","v":5092.2000000000007},{"$f":"IF(H30=0,0,L30/H30)","v":0.8}]
[]
["Coût direct de fonctionnement"]
["Consommables\n(Choisir dans la liste déroulante ci-dessous)",null,null,null,null,null,null,"Coût ",null,null,null,"Bailleurs de fonds"]
["Déplacements",null,null,null,null,null,null,500,null,null,null,{"$f":"IF(OR($M34=0,$H34=\"\"),\"\",$M34*$H34)","v":500},1]
[null,null,null,null,null,null,null,null,null,null,null,""]
[null,null,null,null,null,null,null,null,null,null,null,""]
[null,null,null,null,"Dépenses générales (sous-total)",null,null,{"$f":"SUM(H34:H36)","v":500},null,null,null,{"$f":"SUM(L34:L36)","v":500},{"$f":"IF(H37=0,0,L37/H37)","v":1}]
[]
["Coûts liés aux équipements"]
["Immobilisations corporelles\n(Choisir dans la liste déroulante ci-dessous)","Connaissez-vous le coût lié à l'équipement?","Durée du projet \nen mois","Coût d'acquisition","Durée de vie de l'équipement \nen années","Coût annuel",null,"Coût",null,null,null,"Bailleurs de fonds"]
{"$rows_left_out":27}
{"sheet":"Glossaire","index":2,"n_rows":17,"n_cols":2,"rows_kept":17,"cut":false,"hidden":false,"merged":[]}
["Budget sur la durée du projet de recherche"]
[]
["Glossaire"]
[]
["Coût:","Tous les coûts s'entendent pour l'ensemble de la durée du projet."]
["Coût direct additionnel:","Coût supplémentaire pour mener le projet en terme de charges en personnel."]
["Coût direct d'encadrement:","Les coûts directs d'encadrement concernent les ressources en personnel du corps enseignant et corps professoral nécessaires à l’encadrement du projet."]
["Nbre Poste","Le nombre de poste désigne ici le nombre de personne , et non des équivalents plein temps. Il ne peut y avoir que des nombres entiers."]
["Taux d'activité (en %)","Le taux consacré au projet (40h par semaine = 100%)."]
["Durée en mois","Le nombre de mois  durant lequel le collaborateur travaille pour le projet."]
["Salaire mensuel, si connu d'avance \n(sans charges soc.)","Si vous connaissez  d'avance le salaire de la personne, veuillez inscrire le salaire mensuel en excluant toutes charges sociales payées par l'employeur. Si vous conaissez seulement la classe et l'annuité de la personne, vous pouvez utiliser l'échelle de traitements ci-après."]
["Echelle de traitement","https://www.ge.ch/document/echelle-traitements-au-01012020."]
["Salaire moy. Indicatif (sans ch. soc.)","Le salaire moyen mensuel se calcule automatiquement en fonction de la catégorie de personnel. Il  est indicatif et utilisé quand le salaire n'est pas connu d'avance."]
["Coût direct de fonctionnement","Ces coûts concernent tous les consommables dont l'utilisation est immédiate. Tout bien pouvant être amorti sur plusieurs années doit être exclu de ce type de dépenses, et doivent être considéré comme équipements (immobilisation corporelle)."]
["Coûts liés aux équipements","Ces coûts sont rattachés à l'utilisation d'équipement dont la durée de vie dépend du type de bien. Les coûts liés aux équipements se calculent en fonction du coût d'acquisition du bien, de sa durée de vie et de l'utilisation de l'équipement en mois."]
["Coûts liés aux locaux","Les coûts liés aux locaux représentent les charges d'infrastructure qui varient selon la catégorie de personnel liée au coût direct additionnel. Le calcul prend en compte le coût des locaux selon la catégorie de personnel, la durée du projet ainsi que le taux d'activité s'il est inférieur à 50%. Pour un taux d'activité égal ou supérieur à 50% on considère que les locaux seront occupés à 100% pendant la durée du projet."]
["Coûts de support administratif","Ces coûts peuvent être assimilés à des overheads. Ce sont des coûts indirects liés à l'administration centrale."]

{"sheet":"Lookup","index":3,"n_rows":25,"n_cols":19,"rows_kept":25,"cut":false,"hidden":true,"merged":[]}
["Personnel direct","Salaire moyen / an","Salaire moyen mensuel","m2","Coût locaux admin",null,"Personnel d'encadrement","Salaire moyen / an","Salaire moyen mensuel","m2","Coût locaux admin",null,"Locaux","Coûts / m2",null,"Consommables",null,"Immobilisations","Durée d'utilité"]
["1100-Chargés d'Ens., Cons. Etudes",131000,{"$f":"B2/12","v":10916.666666666666},10,{"$f":"D2*$N$3","v":3920},null,"0100-Professeurs ordinaires",207000,{"$f":"H2/12","v":17250},20,{"$f":"J2*$N$3","v":7840},null,"Archivage et surfaces d'entreposage",196,null,"Fourniture",null,"Mobilier",8]
["1200-MER,chefs de clinique scient.",151000,12583.333333333334,10,3920,null,"0150-Professeurs associés",164000,{"$f":"H3/12","v":13666.666666666666},15,{"$f":"J3*$N$3","v":5880},null,"Bureaux",392,null,"Entretien mobilier & machine",null,"Machines et outillage",5]
["1220-Chargés de cours",147000,12250,10,3920,null,"0200-Professeurs assistants",140000,11666.666666666666,15,{"$f":"J4*$N$3","v":5880},null,"Locaux du domaine social",430,null,"Déplacements",null,"Appareils scientifiques",5]
["1260-Coll. scientifique I et II",117000,9750,10,3920,null,"0500-Professeurs associés (PAE)",155000,12916.666666666666,15,{"$f":"J5*$N$3","v":5880},null,"Bibliothèques",468,null,"Consommables",null,"Matériel informatique",4]
["1300-Maîtres assistants",100000,8333.3333333333339,7.5,2940,null,"0600-Professeurs titulaires",157000,13083.333333333334,15,{"$f":"J6*$N$3","v":5880},null,"Salle de cours",667,null,"Divers"]
["1400-Assistants et post-doc",75000,6250,7.5,2940,null,"1100-Chargés d'Ens., Cons. Etudes",131000,10916.666666666666,10,3920,null,"Laboratoires",805]
["1401-Assistants-médecins",99000,8250,7.5,2940,null,"1200-MER,chefs de clinique scient.",151000,12583.333333333334,10,3920]
["1510-Auxiliaires de Recherche",58000,4833.333333333333,7.5,2940,null,"1220-Chargés de cours",147000,12250,10,3920]
["2000-Personnel scientifiques",129000,10750,10,3920,null,"1260-Coll. scientifique I et II",117000,9750,10,3920]
["2100-Techniciens",103000,8583.3333333333339,9,3528]
["2200-Laborants et ass. techniques",94000,7833.333333333333,9,3528]
["2300-Aides ass. techn et aides labo",78000,6500,9,3528]
["2400-Bibliothécaires, documentalist",104000,8666.6666666666661,12,4704]
["2700-Adm, chefs serv, commis adm",124000,10333.333333333334,15,5880]
["2705-Coordination info documentaire",120000,10000,9,3528]
["2710-BDA Responsables",109000,9083.3333333333339,15,5880]
["2715-BDA Spécialistes disciplines",107000,8916.6666666666661,12,4704]
["2800-Secr, comptables, aide bibl",89000,7416.666666666667,9,3528]
["2805-Commis 2 DIS",58000,4833.333333333333,9,{"$f":"D20*$N$3","v":3528}]
["0100-Professeurs ordinaires",207000,{"$f":"B21/12","v":17250},20,7840]
["0150-Professeurs associés",164000,{"$f":"B22/12","v":13666.666666666666},15,5880]
["0200-Professeurs assistants",140000,11666.666666666666,15,5880]
["0500-Professeurs associés (PAE)",155000,12916.666666666666,15,5880]
["0600-Professeurs titulaires",157000,13083.333333333334,15,5880]

{"sheet":"Exporter la feuille de calcul","index":4,"n_rows":5724,"n_cols":10,"rows_kept":5724,"cut":false,"hidden":true,"merged":[]}
["LOC_ANNEE","BAT_C_ALPHA","BAT_NO_BAT_PLAN","BAT_NOM","STATUT","TYPLOCAL","LIBELLE_TYPE","DESCRIPTION_COUT","COUT_M2","SURFACE"]
[2011,"BC",1,"UNI BASTIONS","A","AR","ARCHIVES","Archivage et surfaces d'entreposage (Ar)",196,17]
[2011,"BC",1,"UNI BASTIONS","A","AU","AUDITOIRE","Salles de cours (Hö)",667,67]
[2011,"BC",1,"UNI BASTIONS","A","AU","AUDITOIRE","Salles de cours (Hö)",667,69.5]
[2011,"BC",1,"UNI BASTIONS","A","AU","AUDITOIRE","Salles de cours (Hö)",667,75.5]
[2011,"BC",1,"UNI BASTIONS","A","AU","AUDITOIRE","Salles de cours (Hö)",667,76.5]
[2011,"BC",1,"UNI BASTIONS","A","AU","AUDITOIRE","Salles de cours (Hö)",667,76.5]
[2011,"BC",1,"UNI BASTIONS","A","AU","AUDITOIRE","Salles de cours (Hö)",667,79]
[2011,"BC",1,"UNI BASTIONS","A","AU","AUDITOIRE","Salles de cours (Hö)",667,79]
[2011,"BC",1,"UNI BASTIONS","A","AU","AUDITOIRE","Salles de cours (Hö)",667,107.5]
[2011,"BC",1,"UNI BASTIONS","A","AU","AUDITOIRE","Salles de cours (Hö)",667,119]
[2011,"BC",1,"UNI BASTIONS","A","AU","AUDITOIRE","Salles de cours (Hö)",667,168.5]
[2011,"BC",1,"UNI BASTIONS","A","AU","AUDITOIRE","Salles de cours (Hö)",667,202.5]
[2011,"BC",1,"UNI BASTIONS","A","AU","AUDITOIRE","Salles de cours (Hö)",667,302.5]
[2011,"BC",1,"UNI BASTIONS","A","AX","ANNEXES","Archivage et surfaces d'entreposage (Ar)",196,25]
[2011,"BC",1,"UNI BASTIONS","A","BI","BIBLIOTHEQUE, SALLE DE LECTURE","Bibliothèques (Bi)",468,2]
[2011,"BC",1,"UNI BASTIONS","A","BI","BIBLIOTHEQUE, SALLE DE LECTURE","Bibliothèques (Bi)",468,16.899999999999999]
[2011,"BC",1,"UNI BASTIONS","A","BI","BIBLIOTHEQUE, SALLE DE LECTURE","Bibliothèques (Bi)",468,22.5]
[2011,"BC",1,"UNI BASTIONS","A","BI","BIBLIOTHEQUE, SALLE DE LECTURE","Bibliothèques (Bi)",468,35]
[2011,"BC",1,"UNI BASTIONS","A","BI","BIBLIOTHEQUE, SALLE DE LECTURE","Bibliothèques (Bi)",468,38.5]
[2011,"BC",1,"UNI BASTIONS","A","BI","BIBLIOTHEQUE, SALLE DE LECTURE","Bibliothèques (Bi)",468,40]
[2011,"BC",1,"UNI BASTIONS","A","BI","BIBLIOTHEQUE, SALLE DE LECTURE","Bibliothèques (Bi)",468,54.3]
[2011,"BC",1,"UNI BASTIONS","A","BI","BIBLIOTHEQUE, SALLE DE LECTURE","Bibliothèques (Bi)",468,55.6]
[2011,"BC",1,"UNI BASTIONS","A","BI","BIBLIOTHEQUE, SALLE DE LECTURE","Bibliothèques (Bi)",468,58]
[2011,"BC",1,"UNI BASTIONS","A","BI","BIBLIOTHEQUE, SALLE DE LECTURE","Bibliothèques (Bi)",468,58]
[2011,"BC",1,"UNI BASTIONS","A","BI","BIBLIOTHEQUE, SALLE DE LECTURE","Bibliothèques (Bi)",468,148]
[2011,"BC",1,"UNI BASTIONS","A","BI","BIBLIOTHEQUE, SALLE DE LECTURE","Bibliothèques (Bi)",468,246]
[2011,"BC",1,"UNI BASTIONS","A","BU","BUREAU","Bureaux (Bü)",392,6]
[2011,"BC",1,"UNI BASTIONS","A","BU","BUREAU","Bureaux (Bü)",392,10]
[2011,"BC",1,"UNI BASTIONS","A","BU","BUREAU","Bureaux (Bü)",392,11.5]
[2011,"BC",1,"UNI BASTIONS","A","BU","BUREAU","Bureaux (Bü)",392,12]
[2011,"BC",1,"UNI BASTIONS","A","BU","BUREAU","Bureaux (Bü)",392,12]
[2011,"BC",1,"UNI BASTIONS","A","BU","BUREAU","Bureaux (Bü)",392,12.5]
[2011,"BC",1,"UNI BASTIONS","A","BU","BUREAU","Bureaux (Bü)",392,12.5]
[2011,"BC",1,"UNI BASTIONS","A","BU","BUREAU","Bureaux (Bü)",392,12.5]
[2011,"BC",1,"UNI BASTIONS","A","BU","BUREAU","Bureaux (Bü)",392,14]
[2011,"BC",1,"UNI BASTIONS","A","BU","BUREAU","Bureaux (Bü)",392,14.5]
[2011,"BC",1,"UNI BASTIONS","A","BU","BUREAU","Bureaux (Bü)",392,15]
[2011,"BC",1,"UNI BASTIONS","A","BU","BUREAU","Bureaux (Bü)",392,15]
[2011,"BC",1,"UNI BASTIONS","A","BU","BUREAU","Bureaux (Bü)",392,15.5]
{"$rows_left_out":5684}