{"text_format":"1","workbook":"xlsx","n_sheets":3,"sheets":["Budget","Lookup","EchelleTraitement"],"not_rendered":{"charts":0,"images":0,"macros":1,"external_links":0,"defined_names":2,"comments":0,"pivot_tables":0},"unopened":[],"bounds":{"document_bytes":16777216,"sheet_cells":100000,"rows_first":2000,"rows_last":500,"rows_between":2000,"halvings":0,"cell_chars":16384,"cell_head_chars":4096},"cells_cut":0,"cells_raw":0,"read":"whole","date_system":"1900"}

{"sheet":"Budget","index":0,"n_rows":106,"n_cols":17,"rows_kept":106,"cut":false,"hidden":false,"merged":[[59,1,59,4],[73,1,73,4],[74,1,74,4],[47,1,47,4],[48,1,48,4],[49,1,49,4],[50,1,50,4],[51,1,51,4],[52,1,52,4],[69,1,69,4],[70,1,70,4],[71,1,71,4],[72,1,72,4],[56,1,56,4],[57,1,57,4],[65,0,65,6],[0,0,0,14],[2,0,2,14],[11,3,11,14],[44,3,44,7],[20,3,20,7],[21,3,21,7],[33,3,33,7],[105,2,109,2],[105,0,109,1],[53,3,53,7],[3,1,3,7],[22,3,22,7],[31,3,31,7],[32,3,32,7],[42,3,42,7],[43,3,43,7],[100,6,100,7],[60,1,60,4],[61,1,61,4],[89,3,89,5],[75,3,75,7],[62,3,62,7],[58,1,58,4]]}
["Budget prévisionnel"]
[]
[]
["Nom du projet"]
[]
["Structure"]
["Entité"]
[]
["Date de début du projet"]
["Date de fin du projet"]
[]
["Nombre de tranches"]
[]
["Responsable (s) du projet, charges d'encadrement"]
["Nom du/des responsable(s)","Fonction","Classe","Annuité","Salaire mensuel","Unité durée","Durée","Taux d'activité","Coûts en CHF\nTranche 1","Coûts en CHF\nTranche 2","Coûts en CHF\nTranche 3","Coûts en CHF\nTranche 4","Coûts en CHF\nTranche 5","Coûts en CHF\nTranche 6","Coût Total\nCHF"]
[null,null,{"$f":"IF($B16=\"\",\"\",_xlfn.XLOOKUP($B16,Lookup!$J:$J,Lookup!$K:$K))","v":""},{"$f":"IF($B16=\"\",\"\",_xlfn.XLOOKUP($B16,Lookup!$J:$J,Lookup!$L:$L))","v":""},{"$f":"IF($B16=\"\",\"\",_xlfn.XLOOKUP($C16&$D16,EchelleTraitement!$A:$A,EchelleTraitement!$D:$D)/12)","v":""},{"$f":"IF($B16=\"\",\"\",\"Mois\")","v":""},null,null,null,null,null,null,null,null,{"$f":"IF($E16=\"\",\"\",$E16*IF($F16=\"Mois\",$G16,$G16/(21*8))*$H16)","v":""},{"$f":"IFERROR(IF(OR($B$12=\"\",$B$12=1),\"\",IF($B16<>\"\",IF(ROUND(O16,0)=ROUND(SUM($I16:$N16),0),\"\",\"Veuillez renseigner correctement les montants des tranches\"),\"\")),\"\")","v":""}]
[null,null,{"$f":"IF($B17=\"\",\"\",_xlfn.XLOOKUP($B17,Lookup!$J:$J,Lookup!$K:$K))","v":""},{"$f":"IF($B17=\"\",\"\",_xlfn.XLOOKUP($B17,Lookup!$J:$J,Lookup!$L:$L))","v":""},{"$f":"IF($B17=\"\",\"\",_xlfn.XLOOKUP($C17&$D17,EchelleTraitement!$A:$A,EchelleTraitement!$D:$D)/12)","v":""},"",null,null,null,null,null,null,null,null,{"$f":"IF($E17=\"\",\"\",$E17*IF($F17=\"Mois\",$G17,$G17/(21*8))*$H17)","v":""},{"$f":"IFERROR(IF(OR($B$12=\"\",$B$12=1),\"\",IF($B17<>\"\",IF(ROUND(O17,0)=ROUND(SUM($I17:$N17),0),\"\",\"Veuillez renseigner correctement les montants des tranches\"),\"\")),\"\")","v":""}]
[null,null,{"$f":"IF($B18=\"\",\"\",_xlfn.XLOOKUP($B18,Lookup!$J:$J,Lookup!$K:$K))","v":""},{"$f":"IF($B18=\"\",\"\",_xlfn.XLOOKUP($B18,Lookup!$J:$J,Lookup!$L:$L))","v":""},{"$f":"IF($B18=\"\",\"\",_xlfn.XLOOKUP($C18&$D18,EchelleTraitement!$A:$A,EchelleTraitement!$D:$D)/12)","v":""},"",null,null,null,null,null,null,null,null,{"$f":"IF($E18=\"\",\"\",$E18*IF($F18=\"Mois\",$G18,$G18/(21*8))*$H18)","v":""},""]
[null,null,{"$f":"IF($B19=\"\",\"\",_xlfn.XLOOKUP($B19,Lookup!$J:$J,Lookup!$K:$K))","v":""},{"$f":"IF($B19=\"\",\"\",_xlfn.XLOOKUP($B19,Lookup!$J:$J,Lookup!$L:$L))","v":""},{"$f":"IF($B19=\"\",\"\",_xlfn.XLOOKUP($C19&$D19,EchelleTraitement!$A:$A,EchelleTraitement!$D:$D)/12)","v":""},"",null,null,null,null,null,null,null,null,{"$f":"IF($E19=\"\",\"\",$E19*IF($F19=\"Mois\",$G19,$G19/(21*8))*$H19)","v":""},""]
[null,null,{"$f":"IF($B20=\"\",\"\",_xlfn.XLOOKUP($B20,Lookup!$J:$J,Lookup!$K:$K))","v":""},{"$f":"IF($B20=\"\",\"\",_xlfn.XLOOKUP($B20,Lookup!$J:$J,Lookup!$L:$L))","v":""},{"$f":"IF($B20=\"\",\"\",_xlfn.XLOOKUP($C20&$D20,EchelleTraitement!$A:$A,EchelleTraitement!$D:$D)/12)","v":""},"",null,null,null,null,null,null,null,null,{"$f":"IF($E20=\"\",\"\",$E20*IF($F20=\"Mois\",$G20,$G20/(21*8))*$H20)","v":""},""]
[null,null,null,"Charges de personnel d'encadrement",null,null,null,null,{"$f":"SUM(I16:I20)","v":0},0,0,0,0,0,0]
[null,null,null,"Cotisations patronales (23%)",null,null,null,null,{"$f":"I21*0.23","v":0},0,0,0,0,0,{"$f":"O21*0.23","v":0}]
[null,null,null,"Charges de personnel d'encadrement (sous-total)",null,null,null,null,{"$f":"SUM(I21:I22)","v":0},{"$f":"SUM(J21:J22)","v":0},0,0,0,0,0]
[]
["Charges de personnel PENS"]
["Nom / Rôle","Fonction","Classe","Annuité","Salaire mensuel","Unité durée","Durée","Taux d'activité",{"$f":"I$15","v":"Coûts en CHF\nTranche 1"},"Coûts en CHF\nTranche 2","Coûts en CHF\nTranche 3","Coûts en CHF\nTranche 4","Coûts en CHF\nTranche 5","Coûts en CHF\nTranche 6","Coût Total\nCHF"]
[null,null,{"$f":"IF($B27=\"\",\"\",_xlfn.XLOOKUP($B27,Lookup!$P:$P,Lookup!$Q:$Q))","v":""},{"$f":"IF($B27=\"\",\"\",_xlfn.XLOOKUP($B27,Lookup!$P:$P,Lookup!$R:$R))","v":""},{"$f":"IF($B27=\"\",\"\",_xlfn.XLOOKUP($C27&$D27,EchelleTraitement!$A:$A,EchelleTraitement!$D:$D)/12)","v":""},{"$f":"IF($B27=\"\",\"\",\"Mois\")","v":""},null,null,null,null,null,null,null,null,{"$f":"IF($E27=\"\",\"\",$E27*IF($F27=\"Mois\",$G27,$G27/(21*8))*$H27)","v":""},{"$f":"IFERROR(IF(OR($B$12=\"\",$B$12=1),\"\",IF($B27<>\"\",IF(ROUND(O27,0)=ROUND(SUM($I27:$N27),0),\"\",\"Veuillez renseigner correctement les montants des tranches\"),\"\")),\"\")","v":""}]
[null,null,{"$f":"IF($B28=\"\",\"\",_xlfn.XLOOKUP($B28,Lookup!$P:$P,Lookup!$Q:$Q))","v":""},{"$f":"IF($B28=\"\",\"\",_xlfn.XLOOKUP($B28,Lookup!$P:$P,Lookup!$R:$R))","v":""},{"$f":"IF($B28=\"\",\"\",_xlfn.XLOOKUP($C28&$D28,EchelleTraitement!$A:$A,EchelleTraitement!$D:$D)/12)","v":""},"",null,null,null,null,null,null,null,null,{"$f":"IF($E28=\"\",\"\",$E28*IF($F28=\"Mois\",$G28,$G28/(21*8))*$H28)","v":""},""]
[null,null,{"$f":"IF($B29=\"\",\"\",_xlfn.XLOOKUP($B29,Lookup!$P:$P,Lookup!$Q:$Q))","v":""},{"$f":"IF($B29=\"\",\"\",_xlfn.XLOOKUP($B29,Lookup!$P:$P,Lookup!$R:$R))","v":""},{"$f":"IF($B29=\"\",\"\",_xlfn.XLOOKUP($C29&$D29,EchelleTraitement!$A:$A,EchelleTraitement!$D:$D)/12)","v":""},"",null,null,null,null,null,null,null,null,{"$f":"IF($E29=\"\",\"\",$E29*IF($F29=\"Mois\",$G29,$G29/(21*8))*$H29)","v":""},""]
[null,null,{"$f":"IF($B30=\"\",\"\",_xlfn.XLOOKUP($B30,Lookup!$P:$P,Lookup!$Q:$Q))","v":""},{"$f":"IF($B30=\"\",\"\",_xlfn.XLOOKUP($B30,Lookup!$P:$P,Lookup!$R:$R))","v":""},{"$f":"IF($B30=\"\",\"\",_xlfn.XLOOKUP($C30&$D30,EchelleTraitement!$A:$A,EchelleTraitement!$D:$D)/12)","v":""},"",null,null,null,null,null,null,null,null,{"$f":"IF($E30=\"\",\"\",$E30*IF($F30=\"Mois\",$G30,$G30/(21*8))*$H30)","v":""},""]
[null,null,{"$f":"IF($B31=\"\",\"\",_xlfn.XLOOKUP($B31,Lookup!$P:$P,Lookup!$Q:$Q))","v":""},{"$f":"IF($B31=\"\",\"\",_xlfn.XLOOKUP($B31,Lookup!$P:$P,Lookup!$R:$R))","v":""},{"$f":"IF($B31=\"\",\"\",_xlfn.XLOOKUP($C31&$D31,EchelleTraitement!$A:$A,EchelleTraitement!$D:$D)/12)","v":""},"",null,null,null,null,null,null,null,null,{"$f":"IF($E31=\"\",\"\",$E31*IF($F31=\"Mois\",$G31,$G31/(21*8))*$H31)","v":""},""]
[null,null,null,"Charges de personnel PENS",null,null,null,null,{"$f":"SUM(I27:I31)","v":0},0,0,0,0,0,0]
[null,null,null,"Cotisations patronales (23%)",null,null,null,null,{"$f":"I32*0.23","v":0},0,0,0,0,0,0]
[null,null,null,"Charges de personnel PENS (sous-total)",null,null,null,null,{"$f":"SUM(I32:I33)","v":0},0,0,0,0,0,0]
[]
["Charges de personnel PAT"]
["Nom / Rôle","Fonction","Classe","Annuité","Salaire mensuel","Unité durée","Durée","Taux d'activité",{"$f":"I$15","v":"Coûts en CHF\nTranche 1"},"Coûts en CHF\nTranche 2","Coûts en CHF\nTranche 3","Coûts en CHF\nTranche 4","Coûts en CHF\nTranche 5","Coûts en CHF\nTranche 6","Coût Total\nCHF"]
[null,null,{"$f":"IF($B38=\"\",\"\",_xlfn.XLOOKUP($B38,Lookup!$V:$V,Lookup!$W:$W))","v":""},{"$f":"IF($B38=\"\",\"\",_xlfn.XLOOKUP($B38,Lookup!$V:$V,Lookup!$X:$X))","v":""},{"$f":"IF($B38=\"\",\"\",_xlfn.XLOOKUP($C38&$D38,EchelleTraitement!$A:$A,EchelleTraitement!$D:$D)/12)","v":""},{"$f":"IF($B38=\"\",\"\",\"Mois\")","v":""},null,null,null,null,null,null,null,null,{"$f":"IF($E38=\"\",\"\",$E38*IF($F38=\"Mois\",$G38,$G38/(21*8))*$H38)","v":""},{"$f":"IFERROR(IF(OR($B$12=\"\",$B$12=1),\"\",IF($B38<>\"\",IF(ROUND(O38,0)=ROUND(SUM($I38:$N38),0),\"\",\"Veuillez renseigner correctement les montants des tranches\"),\"\")),\"\")","v":""}]
[null,null,{"$f":"IF($B39=\"\",\"\",_xlfn.XLOOKUP($B39,Lookup!$V:$V,Lookup!$W:$W))","v":""},{"$f":"IF($B39=\"\",\"\",_xlfn.XLOOKUP($B39,Lookup!$V:$V,Lookup!$X:$X))","v":""},{"$f":"IF($B39=\"\",\"\",_xlfn.XLOOKUP($C39&$D39,EchelleTraitement!$A:$A,EchelleTraitement!$D:$D)/12)","v":""},"",null,null,null,null,null,null,null,null,{"$f":"IF($E39=\"\",\"\",$E39*IF($F39=\"Mois\",$G39,$G39/(21*8))*$H39)","v":""},""]
[null,null,{"$f":"IF($B40=\"\",\"\",_xlfn.XLOOKUP($B40,Lookup!$V:$V,Lookup!$W:$W))","v":""},{"$f":"IF($B40=\"\",\"\",_xlfn.XLOOKUP($B40,Lookup!$V:$V,Lookup!$X:$X))","v":""},{"$f":"IF($B40=\"\",\"\",_xlfn.XLOOKUP($C40&$D40,EchelleTraitement!$A:$A,EchelleTraitement!$D:$D)/12)","v":""},"",null,null,null,null,null,null,null,null,{"$f":"IF($E40=\"\",\"\",$E40*IF($F40=\"Mois\",$G40,$G40/(21*8))*$H40)","v":""},""]
{"$rows_left_out":67}
{"sheet":"Lookup","index":1,"n_rows":208,"n_cols":42,"rows_kept":208,"cut":false,"hidden":true,"merged":[]}
["Entité",null,"Entité","Sous-Entité",null,"Type de bailleurs",null,"Fct","Fonction libellé","Fonction personnel encadrement","Classe","Annuité moyenne",null,"Fct","Fonction libellé","Fonction personnel PENS","Classe","Annuité moyenne",null,"Fct","Fonction libellé","Fonction personnel PAT","Classe","Annuité moyenne",null,"Annuités",null,"Catégorie fonctionnement",null,"Utilisation des équipements","Durée d'utilité",null,"Achat d'équipement",null,"Monnaie","Recherche","Taux de change",null,"Structure","Overheads",null,"Taux TVA"]
["Sciences",null,"Divisions","DIBAT",null,"Subvention publique (Etat et Confédération)",null,"PO","Professeur-e ordinaire",{"$f":"H2&\"-\"&I2","v":"PO-Professeur-e ordinaire"},30,13,null,"COLS1","Collaborateur-trice scientifique I",{"$f":"N2&\"-\"&O2","v":"COLS1-Collaborateur-trice scientifique I"},17,7,null,104003,"ingénieur-e ETS d'exploitation",{"$f":"T2&\"-\"&U2","v":"104003-ingénieur-e ETS d'exploitation"},16,7,null,0,null,"Animaux",null,"Utilisation du matériel informatique",4,null,"Appareils scientifiques",null,"CHF",null,1,null,"UNIGE",0.09,null,8.1000000000000003E-2]
["Médecine",null,"Divisions","DIFE",null,"Subvention entreprise privée à but lucratif",null,"PAS","Professeur-e associé-e",{"$f":"H3&\"-\"&I3","v":"PAS-Professeur-e associé-e"},25,12,null,"COLS2","Collaborateur-trice scientifique II",{"$f":"N3&\"-\"&O3","v":"COLS2-Collaborateur-trice scientifique II"},19,8,null,104005,"ingénieur-e - technicien-ne en génie chimique",{"$f":"T3&\"-\"&U3","v":"104005-ingénieur-e - technicien-ne en génie chimique"},16,7,null,1,null,"Annonces, publications",null,"Utilisation de logiciels",4,null,"Matériel informatique",null,"EUR",{"$error":"#VALUE!"},{"$f":"_FV(AJ3,\"Prix\")","v":0.93930000000000002},null,"Sciences",0]
["Lettres",null,"Divisions","DIFIN",null,"Subvention entreprise privée à but non lucratif",null,"PAST","professeur-e assistant-e","PAST-professeur-e assistant-e",24,5,null,"MA","Maître assistant-e","MA-Maître assistant-e",17,5,null,104007,"ingénieur-e ets en électronique","104007-ingénieur-e ets en électronique",16,9,null,2,null,"Articles en Open Access",null,"Utilisation d'appareils scientifiques",5,null,"Logiciels",null,"USD",{"$error":"#VALUE!"},0.91190000000000004,null,"Médecine",0.04]
["Droit",null,"Divisions","DIRH",null,"Mandats / Prestations service",null,"PTI","Professeur-e titulaire","PTI-Professeur-e titulaire",23,17,null,"A2","Assistant-e (A2)","A2-Assistant-e (A2)",8,8,null,104018,"ingénieur-e ETS de recherche","104018-ingénieur-e ETS de recherche",17,9,null,3,null,"Conférenciers jurés",null,"Utilisation de machines et outillage",5,null,"Machines et outillage",null,"GBP",{"$error":"#VALUE!"},1.1148,null,"Lettres",0]
["Théologie",null,"Divisions","DIS",null,"Analyses laboratoire / LTA",null,"CE10","Chargé-e d'enseignement","CE10-Chargé-e d'enseignement",20,13,null,"PDOC","Post-doctorant-e","PDOC-Post-doctorant-e",14,2,null,104020,"ingénieur-e ets spécialiste","104020-ingénieur-e ets spécialiste",17,4,null,4,null,"Consommables",null,"Utilisation du mobilier",8,null,"Mobilier",null,null,null,null,null,"Droit",0]
["FPSE",null,"Divisions","DiSTIC",null,"Inscriptions diverses / Conférences",null,"CS","Chef-fe de clinique scientifique","CS-Chef-fe de clinique scientifique",22,10,null,"MC","Assistant-e médecin (méd. clin.)","MC-Assistant-e médecin (méd. clin.)",16,7,null,104022,"architecte spécialiste","104022-architecte spécialiste",17,12,null,5,null,"Entretien matériel médical",null,null,null,null,null,null,null,null,null,null,"Théologie",0]
["FTI",null,"Rectorat et services rattachés","Affaires internationales",null,"Inscriptions formation continue",null,"MER","Maître d'enseignement et de recherche","MER-Maître d'enseignement et de recherche",23,12,null,"MD","Assistant-e médecin dentiste","MD-Assistant-e médecin dentiste",15,6,null,105004,"ingénieur-e chargé-e de missions techniques","105004-ingénieur-e chargé-e de missions techniques",19,11,null,6,null,"Fournitures générales",null,null,null,null,null,null,null,null,null,null,"FPSE",0]
["GSEM",null,"Rectorat et services rattachés","Affaires juridiques ",null,null,null,"CC10","Chargé-e de cours","CC10-Chargé-e de cours",23,13,null,"ARE","Auxiliaire de recherche et d'enseignement","ARE-Auxiliaire de recherche et d'enseignement",6,1,null,105384,"ingénieur-e universitaire de recherche","105384-ingénieur-e universitaire de recherche",20,10,null,7,null,"Fournitures laboratoire",null,null,null,null,null,null,null,null,null,null,"FTI",0]
["SDS",null,"Rectorat et services rattachés","Bureau de la transistion numérique",null,null,null,"COLS1","Collaborateur-trice scientifique I","COLS1-Collaborateur-trice scientifique I",17,7,null,"PO","Professeur-e ordinaire","PO-Professeur-e ordinaire",30,13,null,201002,"ingénieur-e de système 2","201002-ingénieur-e de système 2",21,10,null,8,null,"Imprimés, impression",null,null,null,null,null,null,null,null,null,null,"GSEM",0]
["Centres interfacultaires",null,"Rectorat et services rattachés","Bureau du développement durable (SDG's)",null,null,null,"COLS2","Collaborateur-trice scientifique II","COLS2-Collaborateur-trice scientifique II",19,8,null,"PAS","Professeur-e associé-e","PAS-Professeur-e associé-e",25,12,null,201003,"ingénieur-e système 3 / chef-fe ingénieur-e de système","201003-ingénieur-e système 3 / chef-fe ingénieur-e de système",23,13,null,9,null,"Location de locaux",null,null,null,null,null,null,null,null,null,null,"SDS",0]
["Divisions",null,"Rectorat et services rattachés","Centre Confucius",null,null,null,null,null,null,null,null,null,"PAST","professeur-e assistant-e","PAST-professeur-e assistant-e",24,5,null,201004,"ingénieur-e de système 1","201004-ingénieur-e de système 1",17,10,null,10,null,"Location matériel",null,null,null,null,null,null,null,null,null,null,"Centres interfacultaires",0]
["Rectorat et services rattachés",null,"Rectorat et services rattachés","Centre de philantropie - Geneva Centre for Philantropy",null,null,null,null,null,null,null,null,null,"PTI","Professeur-e titulaire","PTI-Professeur-e titulaire",23,17,null,201006,"analyste-système","201006-analyste-système",17,7,null,11,null,"Mandat, honoraires prestation",null,null,null,null,null,null,null,null,null,null,"Divisions",0]
[null,null,"Rectorat et services rattachés","Centre Maurice Chalumeau",null,null,null,null,null,null,null,null,null,"CE10","Chargé-e d'enseignement","CE10-Chargé-e d'enseignement",20,13,null,202001,"programmeur-euse 1","202001-programmeur-euse 1",10,1,null,12,null,"Organisation congrès",null,null,null,null,null,null,null,null,null,null,"Rectorat et services rattachés",0]
[null,null,"Rectorat et services rattachés","Commission universitaire d'éthique de la recherche",null,null,null,null,null,null,null,null,null,"CS","Chef-fe de clinique scientifique","CS-Chef-fe de clinique scientifique",22,10,null,202004,"analyste-programmeur-euse de système","202004-analyste-programmeur-euse de système",17,8,null,13,null,"Photocopies, copies"]
[null,null,"Rectorat et services rattachés","Communication",null,null,null,null,null,null,null,null,null,"MER","Maître d'enseignement et de recherche","MER-Maître d'enseignement et de recherche",23,12,null,202005,"analyste en informatique","202005-analyste en informatique",20,9,null,14,null,"Salaires facturés"]
[null,null,"Rectorat et services rattachés","Egalité",null,null,null,null,null,null,null,null,null,"CC10","Chargé-e de cours","CC10-Chargé-e de cours",23,13,null,202006,"concepteur-trice en informatique","202006-concepteur-trice en informatique",23,9,null,15,null,"Taxes, frais divers"]
[null,null,"Rectorat et services rattachés","Expérimentation animale",null,null,null,null,null,null,null,null,null,null,null,null,null,null,null,202007,"programmeur-euse analyste","202007-programmeur-euse analyste",15,3,null,16,null,"Travaux laboratoire"]
[null,null,"Rectorat et services rattachés","Formation continue",null,null,null,null,null,null,null,null,null,null,null,null,null,null,null,202009,"architecte de développement informatique","202009-architecte de développement informatique",23,12,null,17,null,"Déplacement personnel EXTERNE"]
[null,null,"Rectorat et services rattachés","Geneva - Tsinghua Initiative",null,null,null,null,null,null,null,null,null,null,null,null,null,null,null,202012,"informaticien-ne de développement 1","202012-informaticien-ne de développement 1",19,8,null,18,null,"Déplacement personnel INTERNE"]
[null,null,"Rectorat et services rattachés","Geneva Science - Policy Interface",null,null,null,null,null,null,null,null,null,null,null,null,null,null,null,202013,"informaticien-ne de développement 2","202013-informaticien-ne de développement 2",21,13,null,19,null,"Repas personnel EXTERNE"]
[null,null,"Rectorat et services rattachés","InZone",null,null,null,null,null,null,null,null,null,null,null,null,null,null,null,202014,"informaticien-ne de développement 3","202014-informaticien-ne de développement 3",22,12,null,20,null,"Repas personnel INTERNE"]
[null,null,"Rectorat et services rattachés","Mobilité académique",null,null,null,null,null,null,null,null,null,null,null,null,null,null,null,202018,"Développeur/euse 1","202018-Développeur/euse 1",17,4,null,21]
[null,null,"Rectorat et services rattachés","Recherche",null,null,null,null,null,null,null,null,null,null,null,null,null,null,null,202026,"chef-fe de projet 1","202026-chef-fe de projet 1",17,3,null,22]
[null,null,"Rectorat et services rattachés","Rectorat et SG",null,null,null,null,null,null,null,null,null,null,null,null,null,null,null,203036,"ingénieur-e ets en informatique","203036-ingénieur-e ets en informatique",16,11]
[null,null,"Rectorat et services rattachés","Service de l'audit interne",null,null,null,null,null,null,null,null,null,null,null,null,null,null,null,204001,"chimiste","204001-chimiste",18,8]
[null,null,"Rectorat et services rattachés","UNITEC",null,null,null,null,null,null,null,null,null,null,null,null,null,null,null,204002,"chimiste spécialisé-e","204002-chimiste spécialisé-e",19,11]
[null,null,"Rectorat et services rattachés","Welcome Center",null,null,null,null,null,null,null,null,null,null,null,null,null,null,null,204003,"chimiste chef-fe de section","204003-chimiste chef-fe de section",21,8]
[null,null,"Centres interfacultaires","CIBSHM",null,null,null,null,null,null,null,null,null,null,null,null,null,null,null,205001,"biologiste 1","205001-biologiste 1",18,8]
[null,null,"Centres interfacultaires","CIDE",null,null,null,null,null,null,null,null,null,null,null,null,null,null,null,205006,"biologiste 2","205006-biologiste 2",21,12]
[null,null,"Centres interfacultaires","CIGEV",null,null,null,null,null,null,null,null,null,null,null,null,null,null,null,206001,"physicien-ne spécialisé-e","206001-physicien-ne spécialisé-e",19,10]
[null,null,"Centres interfacultaires","CIN",null,null,null,null,null,null,null,null,null,null,null,null,null,null,null,206004,"organisateur-trice-conseil","206004-organisateur-trice-conseil",21,11]
[null,null,"Centres interfacultaires","CISA",null,null,null,null,null,null,null,null,null,null,null,null,null,null,null,206005,"organisateur-trice","206005-organisateur-trice",18,8]
[null,null,"Centres interfacultaires","CUI",null,null,null,null,null,null,null,null,null,null,null,null,null,null,null,206006,"assistant-e organisation","206006-assistant-e organisation",15,7]
[null,null,"Centres interfacultaires","GFRI",null,null,null,null,null,null,null,null,null,null,null,null,null,null,null,206009,"archéologue","206009-archéologue",18,7]
[null,null,"Centres interfacultaires","GSI",null,null,null,null,null,null,null,null,null,null,null,null,null,null,null,206020,"adjoint-e scientifique 3","206020-adjoint-e scientifique 3",21,10]
[null,null,"Centres interfacultaires","IGE3",null,null,null,null,null,null,null,null,null,null,null,null,null,null,null,206022,"concepteur-trice départemental web","206022-concepteur-trice départemental web",15,7]
[null,null,"Centres interfacultaires","IHR",null,null,null,null,null,null,null,null,null,null,null,null,null,null,null,206023,"adjoint-e scientifique 1","206023-adjoint-e scientifique 1",17,5]
[null,null,"Centres interfacultaires","ISE",null,null,null,null,null,null,null,null,null,null,null,null,null,null,null,206024,"adjoint-e scientifique 2","206024-adjoint-e scientifique 2",19,9]
[null,null,"Centres interfacultaires","IUFE",null,null,null,null,null,null,null,null,null,null,null,null,null,null,null,206339,"collaborateur-trice scientifique de rech. dpt d'anthropologie et d'écologie","206339-collaborateur-trice scientifique de rech. dpt d'anthropologie et d'écologie",18,10]
{"$rows_left_out":169}
{"sheet":"EchelleTraitement","index":2,"n_rows":691,"n_cols":4,"rows_kept":691,"cut":false,"hidden":true,"merged":[]}
["ID","Classe","Niveau","Annuel"]
["40",4,0,54194]
["41",4,1,54796]
["42",4,2,55398]
["43",4,3,56000]
["44",4,4,57595]
["45",4,5,59190]
["46",4,6,60785]
["47",4,7,62380]
["48",4,8,63975]
["49",4,9,65570]
["410",4,10,67165]
["411",4,11,68760]
["412",4,12,69362]
["413",4,13,69964]
["414",4,14,70566]
["415",4,15,71168]
["416",4,16,71770]
["417",4,17,72372]
["418",4,18,72974]
["419",4,19,73576]
["420",4,20,74178]
["421",4,21,74780]
["422",4,22,75382]
["50",5,0,56633]
["51",5,1,57234]
["52",5,2,57835]
["53",5,3,58436]
["54",5,4,60027]
["55",5,5,61618]
["56",5,6,63209]
["57",5,7,64800]
["58",5,8,66391]
["59",5,9,67982]
["510",5,10,69573]
["511",5,11,71164]
["512",5,12,71765]
["513",5,13,72366]
["514",5,14,72967]
["515",5,15,73568]
{"$rows_left_out":651}