{"text_format":"1","workbook":"xlsx","n_sheets":6,"sheets":["Budget recherche (vierge)","Exemple","Glossaire","Références listes déroulantes","Exporter la feuille de calcul","Salaire moyen 2012 et 2011"],"not_rendered":{"charts":0,"images":0,"macros":1,"external_links":0,"defined_names":13,"comments":1,"pivot_tables":0},"unopened":[],"bounds":{"document_bytes":16777216,"sheet_cells":100000,"rows_first":2000,"rows_last":500,"rows_between":2000,"halvings":0,"cell_chars":16384,"cell_head_chars":4096},"cells_cut":0,"cells_raw":0,"read":"whole","date_system":"1900"}

{"sheet":"Budget recherche (vierge)","index":0,"n_rows":68,"n_cols":22,"rows_kept":68,"cut":false,"hidden":false,"merged":[[7,6,7,7],[7,3,7,4],[7,1,7,2],[0,1,0,8],[2,1,2,8],[4,2,4,3],[5,2,5,3],[4,4,4,5],[4,6,4,7],[5,4,5,5],[5,6,5,7],[10,1,12,1],[10,2,12,2],[10,3,12,3],[10,4,12,4],[10,5,12,5],[24,4,26,4],[24,5,26,5],[10,9,12,9],[10,10,12,10],[10,12,10,13],[11,12,12,12],[11,13,12,13],[22,5,22,7],[10,6,12,6],[10,7,12,7],[10,8,12,8],[41,5,41,7],[24,7,26,7],[24,8,26,8],[24,12,24,13],[25,12,26,12],[25,13,26,13],[33,5,33,7],[24,6,26,6],[35,1,36,7],[35,8,36,8],[35,12,35,13],[36,12,37,12],[36,13,37,13],[24,1,26,1],[24,2,26,2],[24,3,26,3],[55,5,55,7],[43,8,44,8],[43,12,43,13],[49,5,49,7],[51,5,51,7],[53,1,53,6],[43,1,44,1],[43,2,44,2],[43,3,44,3],[43,4,44,4],[43,5,44,5],[43,6,44,7]]}
[null,"Budget sur la durée du projet de recherche"]
[]
[null,"Merci de remplir uniquement les cellules en jaune."]
[]
[null,"Nom du projet","Responsable du projet",null,"Entité UNIGE",null,"Mandant",null,"Date"]
[]
[]
[null,"À option: convertisseur d'heures en mois",null,"Nombre d'heures",null,null,"Durée en mois",null,{"$f":"ROUNDUP(F8/(21*8),2)&\" mois\"","v":"0 mois"}]
[]
[null,"Coût direct additionnel"]
[null,"Catégorie de personnel\n(Choisir dans la liste déroulante ci-dessous)","Nbre Poste","Taux \nd'activité\n(en %)","Durée \nen mois","Salaire mensuel,\nsi connu d'avance\n(yc. 13ème salaire et sans charges soc.)","Salaire moy. indicatif\n(sans ch. soc.)","Charges sociales\n+23%","Coût ","Coût\nlocaux admin. / an","Coût\nlocaux admin.",null,"Bailleurs de fonds"]
[null,null,null,null,null,null,null,null,null,null,null,null,"CHF","%"]
[]
[null,"Colonne1","Colonne2","Colonne3","Colonne4","Colonne5","  ","  6","  7","  8"," -   "]
[null,null,null,null,null,null,{"$f":"IF(OR($B15=0,$F15<>0),\"\",VLOOKUP('Budget recherche (vierge)'!$B15,'Références listes déroulantes'!$A$4:$E$27,5,FALSE))","v":""},{"$f":"IF(OR($F15<>\"\",$G15<>\"\"),1.23,\"\")","v":""},{"$f":"IF($B15=0,\"\",IF($F15=0,C15*D15*E15*G15*H15,C15*D15*E15*F15*H15))","v":""},{"$f":"IF($B15=0,\"\",VLOOKUP($B15,'Références listes déroulantes'!$A$4:$G$27,7,FALSE))","v":""},{"$f":"_xlfn.IFS($E15=0,0,$D15>=0.5,($J15/12)*$E15,$D15<0.5,($J15/12)*$E15*$D15)","v":0},null,{"$f":"IF(OR($N15=0,$I15=\"\"),\"\",$N15*$I15)","v":""}]
[null,null,null,null,null,null,{"$f":"IF(OR($B16=0,$F16<>0),\"\",VLOOKUP('Budget recherche (vierge)'!$B16,'Références listes déroulantes'!$A$4:$E$27,5,FALSE))","v":""},"",{"$f":"IF($B16=0,\"\",IF($F16=0,C16*D16*E16*G16*H16,C16*D16*E16*F16*H16))","v":""},{"$f":"IF($B16=0,\"\",VLOOKUP($B16,'Références listes déroulantes'!$A$4:$G$27,7,FALSE))","v":""},{"$f":"_xlfn.IFS($E16=0,0,$D16>=0.5,($J16/12)*$E16,$D16<0.5,($J16/12)*$E16*$D16)","v":0},null,{"$f":"IF(OR($N16=0,$I16=\"\"),\"\",$N16*$I16)","v":""}]
[null,null,null,null,null,null,{"$f":"IF(OR($B17=0,$F17<>0),\"\",VLOOKUP('Budget recherche (vierge)'!$B17,'Références listes déroulantes'!$A$4:$E$27,5,FALSE))","v":""},"","",{"$f":"IF($B17=0,\"\",VLOOKUP($B17,'Références listes déroulantes'!$A$4:$G$27,7,FALSE))","v":""},{"$f":"_xlfn.IFS($E17=0,0,$D17>=0.5,($J17/12)*$E17,$D17<0.5,($J17/12)*$E17*$D17)","v":0},null,""]
[null,null,null,null,null,null,{"$f":"IF(OR($B18=0,$F18<>0),\"\",VLOOKUP('Budget recherche (vierge)'!$B18,'Références listes déroulantes'!$A$4:$E$27,5,FALSE))","v":""},"","",{"$f":"IF($B18=0,\"\",VLOOKUP($B18,'Références listes déroulantes'!$A$4:$G$27,7,FALSE))","v":""},{"$f":"_xlfn.IFS($E18=0,0,$D18>=0.5,($J18/12)*$E18,$D18<0.5,($J18/12)*$E18*$D18)","v":0},null,""]
[null,null,null,null,null,null,{"$f":"IF(OR($B19=0,$F19<>0),\"\",VLOOKUP('Budget recherche (vierge)'!$B19,'Références listes déroulantes'!$A$4:$E$27,5,FALSE))","v":""},"","",{"$f":"IF($B19=0,\"\",VLOOKUP($B19,'Références listes déroulantes'!$A$4:$G$27,7,FALSE))","v":""},0,null,""]
[null,null,null,null,null,null,{"$f":"IF(OR($B20=0,$F20<>0),\"\",VLOOKUP('Budget recherche (vierge)'!$B20,'Références listes déroulantes'!$A$4:$E$27,5,FALSE))","v":""},"","",{"$f":"IF($B20=0,\"\",VLOOKUP($B20,'Références listes déroulantes'!$A$4:$G$27,7,FALSE))","v":""},0,null,""]
[null,null,null,null,null,null,{"$f":"IF(OR($B21=0,$F21<>0),\"\",VLOOKUP('Budget recherche (vierge)'!$B21,'Références listes déroulantes'!$A$4:$E$27,5,FALSE))","v":""},"","",{"$f":"IF($B21=0,\"\",VLOOKUP($B21,'Références listes déroulantes'!$A$4:$G$27,7,FALSE))","v":""},0,null,""]
[null,null,null,null,null,null,{"$f":"IF(OR($B22=0,$F22<>0),\"\",VLOOKUP('Budget recherche (vierge)'!$B22,'Références listes déroulantes'!$A$4:$E$27,5,FALSE))","v":""},"",{"$f":"IF($B22=0,\"\",IF($F22=0,C22*D22*E22*G22*H22,C22*D22*E22*F22*H22))","v":""},{"$f":"IF($B22=0,\"\",VLOOKUP($B22,'Références listes déroulantes'!$A$4:$G$27,7,FALSE))","v":""},0,null,""]
[null,null,null,null,null,"Charges de personnel (sous-total)",null,null,{"$f":"SUM(I14:I22)","v":0},{"$f":"SUM(J14:J22)","v":0},{"$f":"SUM(K14:K22)","v":0},null,{"$f":"SUM(M15:M22)","v":0},{"$f":"IF(I23=0,0,M23/I23)","v":0}]
[null,"Coût direct d'encadrement"]
[null,"Catégorie de personnel\n(Choisir dans la liste déroulante ci-dessous)","Nbre Poste","Taux \nd'activité\n(en %)","Durée \nen mois","Salaire mensuel,\nsi connu d'avance\n(yc. 13ème salaire et sans charges soc.)","Salaire moy. indicatif\n(sans ch. soc.)","Charges sociales\n+23%","Coût ",null,null,null,"Bailleurs de fonds"]
[null,null,null,null,null,null,null,null,null,null,null,null,"CHF","%"]
[]
[null,"Colonne1","Colonne2","Colonne3","Colonne4","Colonne5","  ","  6","  7"]
[null,null,null,null,null,null,{"$f":"IF(OR($B29=0,$F29<>0),\"\",VLOOKUP('Budget recherche (vierge)'!$B29,'Références listes déroulantes'!$A$4:$E$27,5,FALSE))","v":""},{"$f":"IF(OR($F29<>\"\",$G29<>\"\"),1.23,\"\")","v":""},{"$f":"IF($B29=0,\"\",IF($F29=0,C29*D29*E29*G29*H29,C29*D29*E29*F29*H29))","v":""},null,null,null,{"$f":"IF(OR($N29=0,$I29=\"\"),\"\",$N29*$I29)","v":""}]
[null,null,null,null,null,null,{"$f":"IF(OR($B30=0,$F30<>0),\"\",VLOOKUP('Budget recherche (vierge)'!$B30,'Références listes déroulantes'!$A$4:$E$27,5,FALSE))","v":""},"",{"$f":"IF($B30=0,\"\",IF($F30=0,C30*D30*E30*G30*H30,C30*D30*E30*F30*H30))","v":""},null,null,null,{"$f":"IF(OR($N30=0,$I30=\"\"),\"\",$N30*$I30)","v":""}]
{"$rows_left_out":39}
{"sheet":"Exemple","index":1,"n_rows":68,"n_cols":22,"rows_kept":68,"cut":false,"hidden":false,"merged":[[7,1,7,2],[7,3,7,4],[7,6,7,7],[35,12,35,13],[35,8,36,8],[36,12,37,12],[36,13,37,13],[43,12,43,13],[10,12,10,13],[11,13,12,13],[11,12,12,12],[24,12,24,13],[25,12,26,12],[25,13,26,13],[53,1,53,6],[55,5,55,7],[49,5,49,7],[51,5,51,7],[33,5,33,7],[35,1,36,7],[41,5,41,7],[43,1,44,1],[43,2,44,2],[43,3,44,3],[43,4,44,4],[43,5,44,5],[43,6,44,7],[43,8,44,8],[10,9,12,9],[10,10,12,10],[22,5,22,7],[24,1,26,1],[24,2,26,2],[24,3,26,3],[24,4,26,4],[24,5,26,5],[24,6,26,6],[24,7,26,7],[24,8,26,8],[0,1,0,8],[10,1,12,1],[10,2,12,2],[10,3,12,3],[10,4,12,4],[10,5,12,5],[10,6,12,6],[10,7,12,7],[10,8,12,8],[2,1,2,8],[4,2,4,3],[4,4,4,5],[4,6,4,7],[5,2,5,3],[5,4,5,5],[5,6,5,7]]}
[null,"Budget sur la durée du projet de recherche"]
[]
[null,"Merci de remplir uniquement les cellules en jaune."]
[]
[null,"Nom du projet","Responsable du projet",null,"Entité UNIGE",null,"Mandataire",null,"Date"]
[null,"Léman Azure","Jérôme TARTEMPION",null,"CISA",null,"CERN",null,"2014-07-15"]
[]
[null,"A option: convertisseur d'heures en mois",null,"Nombre d'heures",null,{"$f":"8*21*6","v":1008},"Durée en mois",null,"6 mois"]
[]
[null,"Coût direct additionnel"]
[null,"Catégorie de personnel\n(Choisir dans la liste déroulante ci-dessous)","Nbre Poste","Taux \nd'activité\n(en %)","Durée \nen mois","Salaire mensuel,\nsi connu d'avance\n(yc. 13ème salaire et sans charges soc.)","Salaire moy. indicatif\n(sans ch. soc.)","Charges sociales\n+20%","Coût ","Coût\nlocaux admin. / an","Coût\nlocaux admin.",null,"Bailleurs de fonds"]
[null,null,null,null,null,null,null,null,null,null,null,null,"CHF","%"]
[]
[null,"Colonne1","Colonne2","Colonne3","Colonne4","Colonne5","  ","  6","  7","  8"," -   "]
[null,"1400-Assistants et post-doc",1,0.8,6,null,{"$f":"IF(OR($B15=0,$F15<>0),\"\",VLOOKUP(Exemple!$B15,'Références listes déroulantes'!$A$4:$E$27,5,FALSE))","v":6250},{"$f":"IF(OR($F15<>\"\",$G15<>\"\"),1.2,\"\")","v":1.2},{"$f":"IF($B15=0,\"\",IF($F15=0,C15*D15*E15*G15*H15,C15*D15*E15*F15*H15))","v":36000},{"$f":"IF($B15=0,\"\",VLOOKUP($B15,'Références listes déroulantes'!$A$4:$G$27,7,FALSE))","v":2940},{"$f":"_xlfn.IFS($E15=0,0,$D15>=0.5,($J15/12)*$E15,$D15<0.5,($J15/12)*$E15*$D15)","v":1470},null,{"$f":"IF(OR($N15=0,$I15=\"\"),\"\",$N15*$I15)","v":36000},1]
[null,null,null,null,null,null,{"$f":"IF(OR($B16=0,$F16<>0),\"\",VLOOKUP(Exemple!$B16,'Références listes déroulantes'!$A$4:$E$27,5,FALSE))","v":""},{"$f":"IF(OR($F16<>\"\",$G16<>\"\"),1.2,\"\")","v":""},{"$f":"IF($B16=0,\"\",IF($F16=0,C16*D16*E16*G16*H16,C16*D16*E16*F16*H16))","v":""},{"$f":"IF($B16=0,\"\",VLOOKUP($B16,'Références listes déroulantes'!$A$4:$G$27,7,FALSE))","v":""},0,null,{"$f":"IF(OR($N16=0,$I16=\"\"),\"\",$N16*$I16)","v":""}]
[null,null,null,null,null,null,{"$f":"IF(OR($B17=0,$F17<>0),\"\",VLOOKUP(Exemple!$B17,'Références listes déroulantes'!$A$4:$E$27,5,FALSE))","v":""},"","",{"$f":"IF($B17=0,\"\",VLOOKUP($B17,'Références listes déroulantes'!$A$4:$G$27,7,FALSE))","v":""},0,null,""]
[null,null,null,null,null,null,{"$f":"IF(OR($B18=0,$F18<>0),\"\",VLOOKUP(Exemple!$B18,'Références listes déroulantes'!$A$4:$E$27,5,FALSE))","v":""},"","",{"$f":"IF($B18=0,\"\",VLOOKUP($B18,'Références listes déroulantes'!$A$4:$G$27,7,FALSE))","v":""},0,null,""]
[null,null,null,null,null,null,{"$f":"IF(OR($B19=0,$F19<>0),\"\",VLOOKUP(Exemple!$B19,'Références listes déroulantes'!$A$4:$E$27,5,FALSE))","v":""},"","",{"$f":"IF($B19=0,\"\",VLOOKUP($B19,'Références listes déroulantes'!$A$4:$G$27,7,FALSE))","v":""},0,null,""]
[null,null,null,null,null,null,{"$f":"IF(OR($B20=0,$F20<>0),\"\",VLOOKUP(Exemple!$B20,'Références listes déroulantes'!$A$4:$E$27,5,FALSE))","v":""},"","",{"$f":"IF($B20=0,\"\",VLOOKUP($B20,'Références listes déroulantes'!$A$4:$G$27,7,FALSE))","v":""},0,null,""]
[null,null,null,null,null,null,{"$f":"IF(OR($B21=0,$F21<>0),\"\",VLOOKUP(Exemple!$B21,'Références listes déroulantes'!$A$4:$E$27,5,FALSE))","v":""},"","",{"$f":"IF($B21=0,\"\",VLOOKUP($B21,'Références listes déroulantes'!$A$4:$G$27,7,FALSE))","v":""},0,null,""]
[null,null,null,null,null,null,{"$f":"IF(OR($B22=0,$F22<>0),\"\",VLOOKUP(Exemple!$B22,'Références listes déroulantes'!$A$4:$E$27,5,FALSE))","v":""},"",{"$f":"IF($B22=0,\"\",IF($F22=0,C22*D22*E22*G22*H22,C22*D22*E22*F22*H22))","v":""},{"$f":"IF($B22=0,\"\",VLOOKUP($B22,'Références listes déroulantes'!$A$4:$G$27,7,FALSE))","v":""},0,null,""]
[null,null,null,null,null,"Charges de personnel (sous-total)",null,null,{"$f":"SUM(I14:I22)","v":36000},{"$f":"SUM(J14:J22)","v":2940},{"$f":"SUM(K14:K22)","v":1470},null,{"$f":"SUM(M15:M22)","v":36000},{"$f":"IF(I23=0,0,M23/I23)","v":1}]
[null,"Coût direct d'encadrement"]
[null,"Catégorie de personnel\n(Choisir dans la liste déroulante ci-dessous)","Nbre Poste","Taux \nd'activité\n(en %)","Durée \nen mois","Salaire mensuel,\nsi connu d'avance\n(yc. 13ème salaire et sans charges soc.)","Salaire moy. indicatif\n(sans ch. soc.)","Charges sociales\n+20%","Coût ",null,null,null,"Bailleurs de fonds"]
[null,null,null,null,null,null,null,null,null,null,null,null,"CHF","%"]
[]
[null,"Colonne1","Colonne2","Colonne3","Colonne4","Colonne5","  ","  6","  7"]
[null,"0100-Professeurs ordinaires",1,0.05,6,null,{"$f":"IF(OR($B29=0,$F29<>0),\"\",VLOOKUP(Exemple!$B29,'Références listes déroulantes'!$A$4:$E$27,5,FALSE))","v":17250},{"$f":"IF(OR($F29<>\"\",$G29<>\"\"),1.2,\"\")","v":1.2},{"$f":"IF($B29=0,\"\",IF($F29=0,C29*D29*E29*G29*H29,C29*D29*E29*F29*H29))","v":6210.0000000000009},null,null,null,{"$f":"IF(OR($N29=0,$I29=\"\"),\"\",$N29*$I29)","v":4968.0000000000009},0.8]
[null,null,null,null,null,null,{"$f":"IF(OR($B30=0,$F30<>0),\"\",VLOOKUP(Exemple!$B30,'Références listes déroulantes'!$A$4:$E$27,5,FALSE))","v":""},{"$f":"IF(OR($F30<>\"\",$G30<>\"\"),1.2,\"\")","v":""},{"$f":"IF($B30=0,\"\",IF($F30=0,C30*D30*E30*G30*H30,C30*D30*E30*F30*H30))","v":""},null,null,null,""]
{"$rows_left_out":39}
{"sheet":"Glossaire","index":2,"n_rows":17,"n_cols":2,"rows_kept":17,"cut":false,"hidden":false,"merged":[]}
["Budget sur la durée du projet de recherche"]
[]
["Glossaire"]
[]
["Coût:","Tous les coûts s'entendent pour l'ensemble de la durée du projet."]
["Coût direct additionnel:","Coût supplémentaire pour mener le projet en terme de charges en personnel."]
["Coût direct d'encadrement:","Les coûts directs d'encadrement concernent les ressources en personnel du corps enseignant et corps professoral nécessaires à l’encadrement du projet."]
["Nbre Poste","Le nombre de poste désigne ici le nombre de personne , et non des équivalents plein temps. Il ne peut y avoir que des nombres entiers."]
["Taux d'activité (en %)","Le taux consacré au projet (40h par semaine = 100%)."]
["Durée en mois","Le nombre de mois  durant lequel le collaborateur travaille pour le projet."]
["Salaire mensuel, si connu d'avance \n(sans charges soc.)","Si vous connaissez  d'avance le salaire de la personne, veuillez inscrire le salaire mensuel en excluant toutes charges sociales payées par l'employeur. Si vous conaissez seulement la classe et l'annuité de la personne, vous pouvez utiliser l'échelle de traitements ci-après."]
["Echelle de traitement","https://www.ge.ch/document/echelle-traitements-au-01012020."]
["Salaire moy. Indicatif (sans ch. soc.)","Le salaire moyen mensuel se calcule automatiquement en fonction de la catégorie de personnel. Il  est indicatif et utilisé quand le salaire n'est pas connu d'avance."]
["Coût direct de fonctionnement","Ces coûts concernent tous les consommables dont l'utilisation est immédiate. Tout bien pouvant être amorti sur plusieurs années doit être exclu de ce type de dépenses, et doivent être considéré comme équipements (immobilisation corporelle)."]
["Coûts liés aux équipements","Ces coûts sont rattachés à l'utilisation d'équipement dont la durée de vie dépend du type de bien. Les coûts liés aux équipements se calculent en fonction du coût d'acquisition du bien, de sa durée de vie et de l'utilisation de l'équipement en mois."]
["Coûts liés aux locaux","Les coûts liés aux locaux représentent les charges d'infrastructure qui varient selon la catégorie de personnel liée au coût direct additionnel. Le calcul prend en compte le coût des locaux selon la catégorie de personnel, la durée du projet ainsi que le taux d'activité s'il est inférieur à 50%. Pour un taux d'activité égal ou supérieur à 50% on considère que les locaux seront occupés à 100% pendant la durée du projet."]
["Coûts de support administratif","Ces coûts peuvent être assimilés à des overheads. Ce sont des coûts indirects liés à l'administration centrale."]

{"sheet":"Références listes déroulantes","index":3,"n_rows":61,"n_cols":7,"rows_kept":61,"cut":false,"hidden":true,"merged":[[1,1,1,2]]}
[]
[null,"Budget 2018"]
["liste2","EPT","Salaire","Salaire moyen / an","Salaire moyen mensuel","m2","Coût locaux admin"]
["0100-Professeurs ordinaires",null,null,207000,{"$f":"D4/12","v":17250},20,{"$f":"F4*$B$32","v":7840}]
["0150-Professeurs associés",null,null,164000,{"$f":"D5/12","v":13666.666666666666},15,5880]
["0200-Professeurs assistants",null,null,140000,11666.666666666666,15,5880]
["0500-Professeurs associés (PAE)",null,null,155000,12916.666666666666,15,5880]
["0600-Professeurs titulaires",null,null,157000,13083.333333333334,15,5880]
["1100-Chargés d'Ens., Cons. Etudes",null,null,131000,10916.666666666666,10,3920]
["1200-MER,chefs de clinique scient.",null,null,151000,12583.333333333334,10,3920]
["1220-Chargés de cours",null,null,147000,12250,10,3920]
["1260-Coll. scientifique I et II",null,null,117000,9750,10,3920]
["1300-Maîtres assistants",null,null,100000,8333.3333333333339,7.5,2940]
["1400-Assistants et post-doc",null,null,75000,6250,7.5,2940]
["1401-Assistants-médecins",null,null,99000,8250,7.5,2940]
["1510-Auxiliaires de Recherche",null,null,58000,4833.333333333333,7.5,2940]
["2000-Personnel scientifiques",null,null,129000,10750,10,3920]
["2100-Techniciens",null,null,103000,8583.3333333333339,9,3528]
["2200-Laborants et ass. techniques",null,null,94000,7833.333333333333,9,3528]
["2300-Aides ass. techn et aides labo",null,null,78000,6500,9,3528]
["2400-Bibliothécaires, documentalist",null,null,104000,8666.6666666666661,12,4704]
["2700-Adm, chefs serv, commis adm",null,null,124000,10333.333333333334,15,5880]
["2705-Coordination info documentaire",null,null,120000,10000,9,3528]
["2710-BDA Responsables",null,null,109000,9083.3333333333339,15,5880]
["2715-BDA Spécialistes disciplines",null,null,107000,8916.6666666666661,12,4704]
["2800-Secr, comptables, aide bibl",null,null,89000,7416.666666666667,9,3528]
["2805-Commis 2 DIS",null,null,58000,4833.333333333333,9,3528]
[]
[]
["liste3","Coûts / m2"]
{"$rows_left_out":32}
{"sheet":"Exporter la feuille de calcul","index":4,"n_rows":5724,"n_cols":10,"rows_kept":5724,"cut":false,"hidden":true,"merged":[]}
["LOC_ANNEE","BAT_C_ALPHA","BAT_NO_BAT_PLAN","BAT_NOM","STATUT","TYPLOCAL","LIBELLE_TYPE","DESCRIPTION_COUT","COUT_M2","SURFACE"]
[2011,"BC",1,"UNI BASTIONS","A","AR","ARCHIVES","Archivage et surfaces d'entreposage (Ar)",196,17]
[2011,"BC",1,"UNI BASTIONS","A","AU","AUDITOIRE","Salles de cours (Hö)",667,67]
[2011,"BC",1,"UNI BASTIONS","A","AU","AUDITOIRE","Salles de cours (Hö)",667,69.5]
[2011,"BC",1,"UNI BASTIONS","A","AU","AUDITOIRE","Salles de cours (Hö)",667,75.5]
[2011,"BC",1,"UNI BASTIONS","A","AU","AUDITOIRE","Salles de cours (Hö)",667,76.5]
[2011,"BC",1,"UNI BASTIONS","A","AU","AUDITOIRE","Salles de cours (Hö)",667,76.5]
[2011,"BC",1,"UNI BASTIONS","A","AU","AUDITOIRE","Salles de cours (Hö)",667,79]
[2011,"BC",1,"UNI BASTIONS","A","AU","AUDITOIRE","Salles de cours (Hö)",667,79]
[2011,"BC",1,"UNI BASTIONS","A","AU","AUDITOIRE","Salles de cours (Hö)",667,107.5]
[2011,"BC",1,"UNI BASTIONS","A","AU","AUDITOIRE","Salles de cours (Hö)",667,119]
[2011,"BC",1,"UNI BASTIONS","A","AU","AUDITOIRE","Salles de cours (Hö)",667,168.5]
[2011,"BC",1,"UNI BASTIONS","A","AU","AUDITOIRE","Salles de cours (Hö)",667,202.5]
[2011,"BC",1,"UNI BASTIONS","A","AU","AUDITOIRE","Salles de cours (Hö)",667,302.5]
[2011,"BC",1,"UNI BASTIONS","A","AX","ANNEXES","Archivage et surfaces d'entreposage (Ar)",196,25]
[2011,"BC",1,"UNI BASTIONS","A","BI","BIBLIOTHEQUE, SALLE DE LECTURE","Bibliothèques (Bi)",468,2]
[2011,"BC",1,"UNI BASTIONS","A","BI","BIBLIOTHEQUE, SALLE DE LECTURE","Bibliothèques (Bi)",468,16.899999999999999]
[2011,"BC",1,"UNI BASTIONS","A","BI","BIBLIOTHEQUE, SALLE DE LECTURE","Bibliothèques (Bi)",468,22.5]
[2011,"BC",1,"UNI BASTIONS","A","BI","BIBLIOTHEQUE, SALLE DE LECTURE","Bibliothèques (Bi)",468,35]
[2011,"BC",1,"UNI BASTIONS","A","BI","BIBLIOTHEQUE, SALLE DE LECTURE","Bibliothèques (Bi)",468,38.5]
[2011,"BC",1,"UNI BASTIONS","A","BI","BIBLIOTHEQUE, SALLE DE LECTURE","Bibliothèques (Bi)",468,40]
[2011,"BC",1,"UNI BASTIONS","A","BI","BIBLIOTHEQUE, SALLE DE LECTURE","Bibliothèques (Bi)",468,54.3]
[2011,"BC",1,"UNI BASTIONS","A","BI","BIBLIOTHEQUE, SALLE DE LECTURE","Bibliothèques (Bi)",468,55.6]
[2011,"BC",1,"UNI BASTIONS","A","BI","BIBLIOTHEQUE, SALLE DE LECTURE","Bibliothèques (Bi)",468,58]
[2011,"BC",1,"UNI BASTIONS","A","BI","BIBLIOTHEQUE, SALLE DE LECTURE","Bibliothèques (Bi)",468,58]
[2011,"BC",1,"UNI BASTIONS","A","BI","BIBLIOTHEQUE, SALLE DE LECTURE","Bibliothèques (Bi)",468,148]
[2011,"BC",1,"UNI BASTIONS","A","BI","BIBLIOTHEQUE, SALLE DE LECTURE","Bibliothèques (Bi)",468,246]
[2011,"BC",1,"UNI BASTIONS","A","BU","BUREAU","Bureaux (Bü)",392,6]
[2011,"BC",1,"UNI BASTIONS","A","BU","BUREAU","Bureaux (Bü)",392,10]
[2011,"BC",1,"UNI BASTIONS","A","BU","BUREAU","Bureaux (Bü)",392,11.5]
{"$rows_left_out":5695}
{"sheet":"Salaire moyen 2012 et 2011","index":5,"n_rows":65,"n_cols":9,"rows_kept":65,"cut":false,"hidden":true,"merged":[[61,0,61,2],[64,1,64,4],[47,0,60,0],[47,1,51,1],[52,1,59,1],[60,1,60,2],[3,0,46,0],[3,1,14,1],[15,1,28,1],[29,1,45,1],[46,1,46,2]]}
["UNIGE - UNIVERSITE DE GENEVE (UNIGE)  - année  2012","Salaire moyen du Budget 2012 UNIGE avec salaire des postes occupés 2011"]
[]
[null,null,null,"Budget (P) 2012","Budget (F) 2012","Salaire moyen (F) Budget 2012","Postes occupés 2011","Consommation (F) 2011","Salaire moyen (F) 2011 des Postes occupés"]
["POSTE","1-C.Prof.","0100-Professeurs ordinaires",348.9,72779797,{"$f":"E4/D4","v":208597.87044998567},291.76,62092716.799999997,{"$f":"H4/G4","v":212821.21195503153}]
[null,null,"0150-Professeurs associés",113.04,18354397,162370.81564048125,86.846000000000004,14054147.85,{"$f":"H5/G5","v":161828.38415125624}]
[null,null,"0200-Professeurs assistants",10.25,1421221,138655.70731707316,5.8769999999999998,815334.85,{"$f":"H6/G6","v":138733.17168623448}]
[null,null,"0400-Professeurs adjoints",0.5,81000,162000]
[null,null,"0500-Professeurs associés (PAE 73)",3.83,593650,155000,null,10505.9]
[null,null,"0600-Professeurs titulaires",20.149999999999999,3291827,163366.10421836231,21.422999999999998,3537579.8,{"$f":"H9/G9","v":165129.9911310274}]
[null,null,"0801-Salaires remplacements DIP",null,987422,null,null,{"$f":"1107687.55+29016.15","v":1136703.7}]
[null,null,"0803-Indemnités spéciales fonction",null,1538650,null,null,{"$f":"1245866.15","v":1245866.1499999999}]
[null,null,"0809-Economie temporaire CP",null,-728498]
[null,null,"0805- Traitements remboursés",null,null,null,null,-324618.40000000002]
[null,null,"0899 Crédits salaires",null,{"$f":"SUM(E10:E13)","v":1797574},null,null,{"$f":"SUM(H10:H13)","v":2057951.4499999997}]
[null,null,"1-C.Prof.",496.67,98319466,null,{"$f":"SUM(G4:G13)","v":405.90600000000001},{"$f":"SUM(H4:H13)","v":82568236.649999991}]
[null,"2-C.Ens.","1100-Chargés d'Ens. , Cons. Etudes",162.91,21344355,{"$f":"E16/D16","v":131019.30513780615},181.631,23756043.050000001,{"$f":"H16/G16","v":130792.88805325082}]
[null,null,"1200-MER,chefs de clinique scient.",122.1,18187188,148953.21867321868,140.505,21279524.23,151450.29877940289]
[null,null,"1220-Chargés de cours",28.27,4347469,153783.83445348425,38.405000000000001,5850754.5499999998,152343.56333810702]
[null,null,"1260-Coll. scientifique I et II",35.799999999999997,4218031,117822.09497206705,37.814999999999998,4304145.3,113821.1106703689]
[null,null,"1300-Maîtres assistants",139.63999999999999,14298670,102396.6628473217,137.875,14331761.65,103947.50063463282]
[null,null,"1400-Assistants et post-doc",598.94000000000005,43919093,73328.034527665543,707.91200000000003,51707515.799999997,73042.293109878054]
[null,null,"1401-Assistants-médecins",50.8,4896073,96379.389763779531,35.578000000000003,3463865.65,97359.763055821008]
[null,null,"1405-Crédits encadrement Taxes",79.260000000000005,5706720,72000]
[null,null,"1510-Auxiliaires de Recherche",19.420000000000002,1134863,58437.847579814617,23.49,1380672.35,{"$f":"H24/G24","v":58777.026394210312}]
[null,null,"1701-Crédits traitements ens. DIP",null,4892698,null,null,{"$f":"297456.1+3663436.6+106279.85+4762.8-236630.95","v":3835304.4}]
[null,null,"1705-Indemn. spéc. FEP (ex LME)",null,665000,null,null,750450]
[null,null,"1709-Economie temporaire CE",null,-241143]
[null,null,"1799 Crédits salaires",null,{"$f":"SUM(E25:E27)","v":5316555},null,null,{"$f":"SUM(H25:H27)","v":4585754.4000000004}]
[null,null,"2-C.Ens.",1237.1400000000001,123369017,null,{"$f":"SUM(G16:G27)","v":1303.211},{"$f":"SUM(H16:H27)","v":130660036.98}]
[null,"3-Pat","2000-Personnel scientifiques",211.3,27364917,{"$f":"E30/D30","v":129507.41599621391},198.30199999999999,25836649.280000001,{"$f":"H30/G30","v":130289.40343516455}]
{"$rows_left_out":35}